{"text_format":"1","workbook":"xlsx","n_sheets":6,"sheets":["シート管理","⑤-1","⑤-2","⑤-注","プルダウン管理","チェックボックス管理"],"not_rendered":{"charts":0,"images":0,"macros":1,"external_links":1,"defined_names":84,"comments":1,"pivot_tables":0},"unopened":[],"bounds":{"document_bytes":16777216,"sheet_cells":100000,"rows_first":2000,"rows_last":500,"rows_between":2000,"halvings":0,"cell_chars":16384,"cell_head_chars":4096},"cells_cut":0,"cells_raw":0,"read":"whole","date_system":"1900"}

{"sheet":"シート管理","index":0,"n_rows":4,"n_cols":3,"rows_kept":4,"cut":false,"hidden":false,"merged":[[1,0,3,0],[0,1,0,2]]}
["申請書","シート"]
["⑤確認申請書（昇降機）","確認申請書(昇降機　第一面）","⑤-1"]
[null,"第二面","⑤-2"]
[null,"注意","⑤-注"]

{"sheet":"⑤-1","index":1,"n_rows":50,"n_cols":22,"rows_kept":50,"cut":false,"hidden":false,"merged":[[45,18,46,18],[45,19,46,19],[45,20,46,20],[47,20,48,20],[45,17,46,17],[47,1,48,1],[47,2,48,6],[47,7,48,7],[47,14,48,14],[47,15,48,19],[44,1,44,7],[44,8,44,13],[44,14,44,20],[45,7,46,7],[45,8,50,13],[45,14,46,14],[45,15,46,15],[45,16,46,16],[49,1,50,7],[49,14,50,20],[45,1,46,1],[45,2,46,2],[45,3,46,3],[45,4,46,4],[45,5,46,5],[45,6,46,6],[4,0,4,21],[7,0,7,21],[33,11,33,19],[34,11,34,19],[35,11,35,19],[11,0,11,21],[12,0,12,21],[13,0,13,21]]}
["第八号様式（第一条の三、第二条の二、第三条の三関係）（昇降機用）（Ａ４）"]
[]
[]
[]
["確 認 申 請 書（昇 降 機）"]
[]
[]
["（第一面）"]
[]
[]
[]
["　建築基準法第８７条の２において準用する同法第６条の２第１項の規定による確認を申請します。"]
["この申請書及び添付図書に記載の事項は、事実に相違ありません。"]
["　申請にあたっては、株式会社秋田建築確認検査機関確認検査業務約款を遵守します。"]
[]
[]
[]
["　株式会社秋田建築確認検査機関"]
["　　代表取締役　大島　由鶴　様"]
[]
[null,null,null,null,null,null,null,null,null,null,null,null,null,null,null,"令和",null,"年",null,"月",null,"日"]
[]
[]
[]
[]
[]
[]
[]
[]
[]
[]
[]
[]
[null,null,null,null,null,null,null,null,null,null,"申請者氏名　　"]
[]
[]
[]
[]
[]
[]
[]
[]
[]
[]
[null,"※受付欄",null,null,null,null,null,null,"※決裁欄",null,null,null,null,null,"※確認番号欄"]
[null,"令和",null,"年",null,"月",null,"日",null,null,null,null,null,null,"令和",null,"年",null,"月",null,"日"]
[]
[null,"第",null,null,null,null,null,"号"]
[]
[null,"係員氏名",null,null,null,null,null,null,null,null,null,null,null,null,"係員氏名"]

{"sheet":"⑤-2","index":2,"n_rows":72,"n_cols":33,"rows_kept":72,"cut":false,"hidden":false,"merged":[[43,8,43,13],[44,12,44,16],[44,17,44,21],[44,22,44,26],[44,27,44,31],[42,8,42,32],[15,8,15,14],[0,0,0,33],[9,9,9,10],[9,18,9,21],[9,27,9,31],[11,9,11,10],[11,18,11,20],[11,27,11,31],[13,8,13,11],[3,8,3,32],[4,8,4,32],[5,8,5,14],[7,8,7,14],[10,8,10,32],[12,8,12,32],[15,23,15,29],[6,8,6,32],[14,8,14,32],[18,18,18,21],[19,8,19,32],[20,18,20,20],[21,8,21,32],[22,8,22,11],[20,27,20,31],[20,9,20,10],[18,9,18,10],[18,27,18,31],[23,8,23,32],[31,8,31,32],[32,8,32,11],[34,8,34,13],[35,12,35,16],[35,17,35,21],[35,22,35,26],[35,27,35,31],[33,8,33,32],[28,9,28,10],[28,18,28,21],[28,27,28,31],[29,8,29,32],[30,9,30,10],[30,18,30,20],[30,27,30,31],[24,8,24,14],[25,12,25,16],[25,17,25,21],[25,22,25,26],[25,27,25,31],[39,9,39,10],[39,18,39,20],[39,27,39,31],[71,8,72,32],[69,10,69,11],[70,10,70,11],[69,13,69,14],[70,13,70,14],[70,16,70,17],[69,16,69,17],[67,12,67,13],[66,15,66,16],[67,15,67,16],[66,18,66,19],[67,18,67,19],[66,12,66,13],[59,11,59,13],[64,8,64,9],[56,8,56,32],[57,8,57,32],[52,8,52,32],[55,8,55,32],[40,8,40,32],[41,8,41,11],[69,3,69,4],[70,3,70,4],[26,12,26,31],[36,12,36,31],[45,12,45,31],[62,8,62,9],[62,12,62,13],[63,8,63,9],[60,8,60,19],[61,8,61,14],[58,8,58,20],[69,21,69,31],[70,21,70,31],[65,10,65,32],[53,8,53,13],[50,8,50,32],[51,8,51,11],[48,8,48,32],[49,25,49,28],[49,14,49,17],[37,9,37,10],[37,18,37,21],[37,27,37,31],[38,8,38,32]]}
["（第二面）"]
[]
["【1.建築主】"]
[null,"【ｲ.氏名のﾌﾘｶﾞﾅ】"]
[null,"【ﾛ.氏　　名】"]
[null,"【ﾊ.郵便番号】"]
[null,"【ﾆ.住　　所】"]
[null,"【ﾎ.電話番号】"]
["【2.代理者】"]
[null,"【ｲ.資　　格】",null,null,null,null,null,null,"（",null,null,"）","建築士",null,null,null,null,"（",null,null,null,null,"）",null,null,null,"登録　　第",null,null,null,null,null,"号"]
[null,"【ﾛ.氏　　名】"]
[null,"【ﾊ.建築士事務所名】",null,null,null,null,null,null,"（",null,null,"）","建築士事務所",null,null,null,null,"（",null,null,null,"）",null,null,null,null,"知事登録　　第",null,null,null,null,null,"号"]
[]
[null,"【ﾆ.郵便番号】"]
[null,"【ﾎ.所 在 地】"]
[null,"【ﾍ.電話番号】",null,null,null,null,null,null,null,null,null,null,null,null,null,null,null,null,"【ﾌｧｯｸｽ番号】"]
["【3.設計者】"]
["（代表となる設計者）"]
[null,"【ｲ.資　　格】",null,null,null,null,null,null,"（",null,null,"）","建築士",null,null,null,null,"（",null,null,null,null,"）",null,null,null,"登録　　第",null,null,null,null,null,"号"]
[null,"【ﾛ.氏　　名】"]
[null,"【ﾊ.建築士事務所名】",null,null,null,null,null,null,"（",null,null,"）","建築士事務所",null,null,null,null,"（",null,null,null,"）",null,null,null,null,"知事登録　第",null,null,null,null,null,"号"]
[]
[null,"【ﾆ.郵便番号】"]
[null,"【ﾎ.所 在 地】"]
[null,"【ﾍ.電話番号】"]
[null,"【ﾄ.作成した設計図書】"]
[]
["（その他の設計者）"]
[null,"【ｲ.資　　格】",null,null,null,null,null,null,"（",null,null,"）","建築士",null,null,null,null,"（",null,null,null,null,"）",null,null,null,"登録　　第",null,null,null,null,null,"号"]
[null,"【ﾛ.氏　　名】"]
[null,"【ﾊ.建築士事務所名】",null,null,null,null,null,null,"（",null,null,"）","建築士事務所",null,null,null,null,"（",null,null,null,"）",null,null,null,null,"知事登録　第",null,null,null,null,null,"号"]
[]
[null,"【ﾆ.郵便番号】"]
[null,"【ﾎ.所 在 地】"]
[null,"【ﾍ.電話番号】"]
[null,"【ﾄ.作成した設計図書】"]
[]
[null,"【ｲ.資　　格】",null,null,null,null,null,null,"（",null,null,"）","建築士",null,null,null,null,"（",null,null,null,null,"）",null,null,null,"登録　　第",null,null,null,null,null,"号"]
[null,"【ﾛ.氏　　名】"]
[null,"【ﾊ.建築士事務所名】",null,null,null,null,null,null,"（",null,null,"）","建築士事務所",null,null,null,null,"（",null,null,null,"）",null,null,null,null,"知事登録　第",null,null,null,null,null,"号"]
[]
[null,"【ﾆ.郵便番号】"]
[null,"【ﾎ.所 在 地】"]
[null,"【ﾍ.電話番号】"]
[null,"【ﾄ.作成した設計図書】"]
[]
[]
["【4.工事施工者】"]
[null,"【ｲ.氏　　名】"]
[null,"【ﾛ.営業所名】",null,null,null,null,null,null,"建設業の許可",null,null,null,null,"（",null,null,null,null,"）","（",null,"－",null,"）","第",null,null,null,null,"号"]
[]
[null,"【ﾊ.郵便番号】"]
[null,"【ﾆ.所 在 地】"]
[null,"【ﾎ.電話番号】"]
["【5.設置する建築物又は工作物】"]
[null,"【ｲ.所在地】"]
[null,"【ﾛ.名称のﾌﾘｶﾞﾅ】"]
[null,"【ﾊ.名　称】"]
[null,"【ﾛ.用　途】"]
["【6.昇降機の概要】",null,null,null,null,null,null,null,"（番号",null,null,null,null,null,"）"]
[null,"【ｲ.種　　別】"]
[null,"【ﾛ.用　　途】"]
[null,"【ﾊ.積載荷重】",null,null,null,null,null,null,null,null,"Ｎ","（",null,null,"㎏","）"]
[null,"【ﾆ.最大定員】",null,null,null,null,null,null,null,null,"人"]
[null,"【ﾎ.定格速度】",null,null,null,null,null,null,null,null,"m/min"]
[null,"【ﾍ.その他必要な事項】"]
["【7.工事着手予定年月日】",null,null,null,null,null,null,null,null,null,"令和",null,null,null,"年",null,null,"月",null,null,"日"]
["【8.工事完了予定年月日】",null,null,null,null,null,null,null,null,null,"令和",null,null,null,"年",null,null,"月",null,null,"日"]
["【9.特定工程工事終了予定年月日】",null,null,null,null,null,null,null,null,null,null,null,null,null,null,null,null,null,null,null,null,null,null,null,"（特定工程）"]
[null,null,"（第",null,null,"回）",null,null,"令和",null,null,null,"年",null,null,"月",null,null,"日",null,"（",null,null,null,null,null,null,null,null,null,null,null,"）"]
[null,null,"（第",null,null,"回）",null,null,"令和",null,null,null,"年",null,null,"月",null,null,"日",null,"（",null,null,null,null,null,null,null,null,null,null,null,"）"]
["【10.備　考】"]

{"sheet":"⑤-注","index":3,"n_rows":31,"n_cols":3,"rows_kept":31,"cut":false,"hidden":false,"merged":[[3,0,3,3],[0,0,0,3],[6,0,6,3],[7,2,7,3],[14,2,14,3],[15,2,15,3],[16,2,16,3],[9,2,9,3],[10,2,10,3],[11,2,11,3],[12,2,12,3],[13,2,13,3],[30,2,30,3],[1,0,1,3],[22,2,22,3],[24,2,24,3],[25,2,25,3],[26,2,26,3],[27,2,27,3],[28,2,28,3],[29,2,29,3],[17,2,17,3],[18,2,18,3],[19,2,19,3],[20,2,20,3],[21,2,21,3],[23,2,23,3],[8,2,8,3]]}
["（注意）"]
["１．各面共通関係"]
["　　　数字は算用数字を、単位はメートル法を用いてください。"]
["２．第一面関係"]
[null,"①","申請者の氏名の記載を自署で行う場合においては、押印を省略することができます。"]
[null,"②","※印のある欄は記入しないでください。"]
["３．第二面関係"]
[null,"①","設置者が２以上のときは、１欄は代表となる設置者について記入し、別紙に他の設置者についてそれぞれ必要"]
[null,null,"な事項を記入して添えてください。"]
[null,"②","設置者からの委任を受けて申請を行う者がいる場合においては、２欄に記入してください。"]
[null,"③","２欄及び３欄は、代理者又は設計者が建築士事務所に属しているときは、その名称を書き、建築士事務所に属"]
[null,null,"していないときは、所在地はそれぞれ代理者又は設計者の住所を書いてください。"]
[null,"④","３欄は、代表となる設計者並びに申請に係る昇降機に係る他のすべての設計者について記入してください。"]
[null,null,"記入欄が不足する場合には、別紙に必要な事項を記入して添えてください。"]
[null,"⑤","４欄は、工事施工者が２以上のときは、代表となる工事施工者について記入し、別紙に他の工事施工者につい"]
[null,null,"てそれぞれ必要な事項を記入して添えてください。工事施工者が未定のときは、後で定まってから工事着手前"]
[null,null,"に届け出てください。"]
[null,"⑥","６欄は、複数の昇降機について同時に申請する場合には、申請する昇降機ごとに通し番号を付した上で、第二"]
[null,null,"面には第１番目の昇降機について記入し、第２番目以降の昇降機については、別紙に必要な事項を記入して"]
[null,null,"添えてください。この際には、添付する図面にもその番号を明示してください。"]
[null,"⑦","６欄の「イ」は、「エレベーター」、「エスカレーター」又は「小荷物専用昇降機」の別を、「ロ」は、「乗用」、「寝台"]
[null,null,"用」又は「自動車運搬用」の別を記入し、「ニ」は、乗用エレベーター及び寝台用エレベーターについてのみ記入"]
[null,null,"してください。"]
[null,"⑧","６欄の「ヘ」は、エスカレーター、小荷物専用昇降機の概要を、また、認証型式部材等製造者が製造した当該認"]
[null,null,"証に係る型式部材等を有する場合は認証番号を記入してください。"]
[null,"⑨","申請に係る昇降機を設置する建築物又は工作物の確認済証番号、確認済証交付年月日及び確認済証交付者"]
[null,null,"が把握できる場合には、１０欄に記入してください。"]
[null,"⑩","建築物に関する確認申請と併せて申請する場合には、６欄に記載したものを第二号様式に追加添付すれば、"]
[null,null,"この様式を別途提出する必要はありません。"]
[null,"⑪","計画の変更申請の際は、１０欄に変更の概要について記入してください。"]
[null,"⑫","ここに書き表せない事項で特に確認を受けようとする事項は、別紙に記載して添えてください。"]

{"sheet":"プルダウン管理","index":4,"n_rows":119,"n_cols":73,"rows_kept":119,"cut":false,"hidden":true,"merged":[]}
["#一般"]
["平成",null,28,29,30,31,32,33,34,35]
["月",null,1,2,3,4,5,6,7,8,9,10,11,12]
["日","　",1,2,3,4,5,6,7,8,9,10,11,12,13,14,15,16,17,18,19,20,21,22,23,24,25,26,27,28,29,30,31]
["都道府県",null,"北海道","青森県","岩手県","宮城県","秋田県","山形県","福島県","茨城県","栃木県","群馬県","埼玉県","千葉県","東京都","神奈川県","新潟県","富山県","石川県","福井県","山梨県","長野県","岐阜県","静岡県","愛知県","三重県","滋賀県","京都府","大阪府","兵庫県","奈良県","和歌山県","鳥取県","島根県","岡山県","広島県","山口県","徳島県","香川県","愛媛県","高知県","福岡県","佐賀県","長崎県","熊本県","大分県","宮崎県","鹿児島県","沖縄県"]
[]
["①-2 "]
["建築士",null,"一級","二級","木造"]
["認可",null,"大臣","北海道知事","青森県知事","岩手県知事","宮城県知事","秋田県知事","山形県知事","福島県知事","茨城県知事","栃木県知事","群馬県知事","埼玉県知事","千葉県知事","東京都知事","神奈川県知事","新潟県知事","富山県知事","石川県知事","福井県知事","山梨県知事","長野県知事","岐阜県知事","静岡県知事","愛知県知事","三重県知事","滋賀県知事","京都府知事","大阪府知事","兵庫県知事","奈良県知事","和歌山県知事","鳥取県知事","島根県知事","岡山県知事","広島県知事","山口県知事","徳島県知事","香川県知事","愛媛県知事","高知県知事","福岡県知事","佐賀県知事","長崎県知事","熊本県知事","大分県知事","宮崎県知事","鹿児島県知事","沖縄県知事"]
[]
[" 【3.設計者】"]
["  【ﾄ.作成又は確認した設計図書】",null,"設計図書一式","意匠図一式","設備図一式","構造図一式","構造計算書"]
[" 【6.工事施工者】"]
["  【ﾛ.営業所名】①",null,"特","般"]
["  【ﾛ.営業所名】②",null,22,23,24,25,26,27,28,29,30,31,32,33]
[]
["①-3"]
[" 【5.その他の区域、地域、地区又は街区】",null,"法第22条区域","特別用途地区","地区計画区域","土地区画整理区域","第一種風致地区","第二種風致地区","第三種風致地区","田園居住型","地域拠点型","沿道拠点型","都市近郊型"]
["  【7.敷地面積】"]
["   【ﾛ.用途地域等】",null,"指定なし","第一種低層住居","第二種低層住居","第一種住居","第二種住居","第一種中高層住居","第二種中高層住居","準住居地域","近隣商業地域","商業地域","準工業地域","工業地域","工業専用地域"]
[" 【8.主要用途】",null,{"$f":"HLOOKUP(#REF!, プルダウン管理!$C$22:$BU$23,2,FALSE)","v":{"$error":"#REF!"}},{"$f":"HLOOKUP(#REF!, プルダウン管理!$C$22:$BU$23,2,FALSE)","v":{"$error":"#REF!"}},{"$f":"HLOOKUP(#REF!, プルダウン管理!$C$22:$BU$23,2,FALSE)","v":{"$error":"#REF!"}},{"$f":"HLOOKUP(#REF!, プルダウン管理!$C$22:$BU$23,2,FALSE)","v":{"$error":"#REF!"}},{"$f":"HLOOKUP(#REF!, プルダウン管理!$C$22:$BU$23,2,FALSE)","v":{"$error":"#REF!"}},{"$f":"HLOOKUP(#REF!, プルダウン管理!$C$22:$BU$23,2,FALSE)","v":{"$error":"#REF!"}},{"$f":"HLOOKUP(#REF!, プルダウン管理!$C$22:$BU$23,2,FALSE)","v":{"$error":"#REF!"}},{"$f":"HLOOKUP(#REF!, プルダウン管理!$C$22:$BU$23,2,FALSE)","v":{"$error":"#REF!"}},{"$f":"HLOOKUP(#REF!, プルダウン管理!$C$22:$BU$23,2,FALSE)","v":{"$error":"#REF!"}},{"$f":"HLOOKUP(#REF!, プルダウン管理!$C$22:$BU$23,2,FALSE)","v":{"$error":"#REF!"}},{"$f":"HLOOKUP(#REF!, プルダウン管理!$C$22:$BU$23,2,FALSE)","v":{"$error":"#REF!"}},{"$f":"HLOOKUP(#REF!, プルダウン管理!$C$22:$BU$23,2,FALSE)","v":{"$error":"#REF!"}},{"$f":"HLOOKUP(#REF!, プルダウン管理!$C$22:$BU$23,2,FALSE)","v":{"$error":"#REF!"}},{"$f":"HLOOKUP(#REF!, プルダウン管理!$C$22:$BU$23,2,FALSE)","v":{"$error":"#REF!"}},{"$f":"HLOOKUP(#REF!, プルダウン管理!$C$22:$BU$23,2,FALSE)","v":{"$error":"#REF!"}},{"$f":"HLOOKUP(#REF!, プルダウン管理!$C$22:$BU$23,2,FALSE)","v":{"$error":"#REF!"}},{"$f":"HLOOKUP(#REF!, プルダウン管理!$C$22:$BU$23,2,FALSE)","v":{"$error":"#REF!"}},{"$f":"HLOOKUP(#REF!, プルダウン管理!$C$22:$BU$23,2,FALSE)","v":{"$error":"#REF!"}},null,{"$f":"HLOOKUP(#REF!, プルダウン管理!C22:BU23,2,FALSE)","v":{"$error":"#REF!"}},{"$f":"HLOOKUP(#REF!, プルダウン管理!$C$22:$BU$23,2,FALSE)","v":{"$error":"#REF!"}},{"$f":"HLOOKUP(#REF!, プルダウン管理!$C$22:$BU$23,2,FALSE)","v":{"$error":"#REF!"}},{"$f":"HLOOKUP(#REF!, プルダウン管理!$C$22:$BU$23,2,FALSE)","v":{"$error":"#REF!"}},{"$f":"HLOOKUP(#REF!, プルダウン管理!$C$22:$BU$23,2,FALSE)","v":{"$error":"#REF!"}},{"$f":"HLOOKUP(#REF!, プルダウン管理!$C$22:$BU$23,2,FALSE)","v":{"$error":"#REF!"}},{"$f":"HLOOKUP(#REF!, プルダウン管理!$C$22:$BU$23,2,FALSE)","v":{"$error":"#REF!"}},{"$f":"HLOOKUP(#REF!, プルダウン管理!$C$22:$BU$23,2,FALSE)","v":{"$error":"#REF!"}},{"$f":"HLOOKUP(#REF!, プルダウン管理!$C$22:$BU$23,2,FALSE)","v":{"$error":"#REF!"}},{"$f":"HLOOKUP(#REF!, プルダウン管理!$C$22:$BU$23,2,FALSE)","v":{"$error":"#REF!"}},{"$f":"HLOOKUP(#REF!, プルダウン管理!$C$22:$BU$23,2,FALSE)","v":{"$error":"#REF!"}},{"$f":"HLOOKUP(#REF!, プルダウン管理!$C$22:$BU$23,2,FALSE)","v":{"$error":"#REF!"}},{"$f":"HLOOKUP(#REF!, プルダウン管理!$C$22:$BU$23,2,FALSE)","v":{"$error":"#REF!"}},{"$f":"HLOOKUP(#REF!, プルダウン管理!$C$22:$BU$23,2,FALSE)","v":{"$error":"#REF!"}},{"$f":"HLOOKUP(#REF!, プルダウン管理!$C$22:$BU$23,2,FALSE)","v":{"$error":"#REF!"}},{"$f":"HLOOKUP(#REF!, プルダウン管理!$C$22:$BU$23,2,FALSE)","v":{"$error":"#REF!"}},{"$f":"HLOOKUP(#REF!, プルダウン管理!$C$22:$BU$23,2,FALSE)","v":{"$error":"#REF!"}},{"$f":"HLOOKUP(#REF!, プルダウン管理!$C$22:$BU$23,2,FALSE)","v":{"$error":"#REF!"}}]
["   区分番号",null,"08010","08020","08030","08040","08050","08060","08070","08080","08090","08100","08110","08120","08130","08132","08140","08150","08160","08170","08180","08190","08210","08230","08240","08250","08260","08270","08280","08290","08300","08310","08320","08330","08340","08350","08360","08370","08370","08380","08390","08390","08400","08410","08420","08430","08438","08440","08450","08452","08456","08456","08456","08456","08458","08460","08470","08480","08490","08500","08510","08520","08530","08540","08550","08560","08570","08580","08590","08600","08610","08620","08990"]
["   ※変換",null,"A0010_","A0020_","A0030_","A0040_","A0050_","A0060_","A0070_","A0080_","A0090_","A0100_","A0110_","A0120_","A0130_","A0140_","A0150_","A0160_","A0170_","A0180_","A0190_","A0200_","A0210_","A0220_","A0230_","A0240_","A0250_","A0260_","A0270_","A0280_","A0290_","A0300_","A0310_","A0320_","A0330_","A0340_","A0350_","A0360_","A0370_","A0380_","A0390_","A0400_","A0410_","A0420_","A0430_","A0440_","A0450_","A0460_","A0470_","A0480_","A0490_","A0500_","A0510_","A0520_","A0530_","A0540_","A0550_","A0560_","A0570_","A0580_","A0590_","A0600_","A0610_","A0620_","A0630_","A0640_","A0650_","A0660_","A0670_","A0680_","A0690_","A0700_","A0710_"]
["   主要用途区分",null,"一戸建ての住宅","長屋","共同住宅","寄宿舎","下宿","店舗併用住宅","幼稚園","小学校","中学校","特別支援学校","大学","専修学校","各種学校","幼保連携認定こども園","図書館","博物館","神社","老人ホーム","保育所","助産所","児童福祉施設等","公衆浴場(個室付浴場に係る公衆浴場を除く)","診療所(患者の収容施設のあるもの)","診療所(患者の収容施設のないもの)","病院","巡査派出所","公衆電話所","郵便法の規定により行う郵便の業務の用に供する施設","地方公共団体の支庁又は支所","公衆便所・休憩所又は路線バスの停留所の上屋","令第１３０条の４第５号に基づき国交大臣が指定する施設","税務署","工場(自動車修理工場を除く)","自動車修理工場","危険物の貯蔵又は処理に供するもの","ボーリング場","ゴルフ練習場","体育館","マージャン屋","カラオケボックス","ホテル","自動車教習所","畜舎","堆肥舎","日用品の販売を主たる目的とする店舗","百貨店","飲食店","食堂","理髪店","洋服店","パン屋","学習塾","銀行の支店","物品販売業を営む店舗以外の店舗","事務所","映画スタジオ","自動車車庫","自転車駐車場","倉庫業を営む倉庫","倉庫業を営まない倉庫","劇場","観覧場","公会堂","展示場","料理店","キャバレー","ダンスホール","個室付浴場","卸売市場","火葬場","その他"]
[null,null,null,null,null,null,null,"事務所併用住宅",null,null,"高等学校",null,"高等専門学校",null,null,null,"町内会館",null,"寺院","身体障害者福祉ホーム",null,null,null,null,null,null,null,null,null,null,null,null,null,"警察署",null,null,null,"スケート場","バッティング練習場","スポーツの練習場","パチンコ屋",null,"旅館",null,null,"水産物の増殖場",null,"マーケット",null,"喫茶店","美容院","畳屋","米屋","華道教室","損害保険代理店",null,null,"テレビスタジオ",null,null,null,null,"映画館",null,"集会場",null,null,"カフェー",null,"ヌードスタジオ",null,"と畜場"]
[null,null,null,null,null,null,null,null,null,null,null,null,null,null,null,null,"集会所",null,"教会",null,null,null,null,null,null,null,null,null,null,null,null,null,null,"保健所",null,null,null,"水泳場",null,null,"射的場",null,null,null,null,"水産物の養殖場",null,"物品販売業を営む店舗",null,null,"クリーニング取次店","建具屋","豆腐屋","囲碁教室","宅地建物取引業を営む店舗",null,null,null,null,null,null,null,"演芸場",null,null,null,null,"ナイトクラブ",null,"のぞき劇場",null,"汚物処理場"]
[null,null,null,null,null,null,null,null,null,null,null,null,null,null,null,null,null,null,null,null,null,null,null,null,null,null,null,null,null,null,null,null,null,"消防署",null,null,null,"スキー場",null,null,"勝馬発売所",null,null,null,null,null,null,null,null,null,"質屋","自転車店","菓子屋",null,null,null,null,null,null,null,null,null,null,null,null,null,null,"バー",null,"ストリップ劇場",null,"ごみ焼却場"]
[null,null,null,null,null,null,null,null,null,null,null,null,null,null,null,null,null,null,null,null,null,null,null,null,null,null,null,null,null,null,null,null,null,null,null,null,null,null,null,null,"場外車券売場",null,null,null,null,null,null,null,null,null,"貸衣装屋","家電店",null,null,null,null,null,null,null,null,null,null,null,null,null,null,null,null,null,null,null,"その他の処理施設"]
[null,null,null,null,null,null,null,null,null,null,null,null,null,null,null,null,null,null,null,null,null,null,null,null,null,null,null,null,null,null,null,null,null,null,null,null,null,null,null,null,null,null,null,null,null,null,null,null,null,null,"貸本屋"]
[" 【12.建築物の数】"]
["  【ｲ.申請に係る建築物の数】",null,1,2,3,4,5]
["  【ﾛ.同一敷地内の他の建築物の数】",null,1,2,3,4,5,6,7,8,9,10]
[" 【13.建築物の高さ等】"]
["  【ﾛ.階数】"]
["   地上",null,1,2,3,4,5,6,7,8,9,10]
["   地下",null,1,2,3]
["  【ﾊ.構造】",null,"木（軸組）","木(枠組壁工法）","鉄筋コンクリート","鉄骨","鉄骨鉄筋コンクリート","アルミニウム合金","コンクリートブロック"]
[" 【17.特定工程工事終了予定年月日】",null,1,2,3]
["①-4"]
[" 【1.番号】",null,1,2,3,4,5,6]
[" 【2.用途】","→","①-3　【8.主要用途】"]
[" 【4.構造】","→","①-3　【ﾊ.構造】"]
[" 【6.階数】"]
[" 【ｲ.地階を除く階数】",null,1,2,3,4,5,6,7,8,9,10]
[" 【ﾛ.地階】",null,1,2,3]
[" 【ﾊ.昇降機塔等の階の数】",null,1,2,3,4,5,6,7,8,9,10]
[" 【ﾆ.地階の倉庫等の階の数】",null,1,2,3,4,5,6,7,8,9,10]
[" 【9.確認の特例】"]
["  【ﾊ.建築基準法施行令第10条各号に掲げる建築物の区分】",null,1,2,3,4]
[" 【15.便所の種類】",null,"水洗(生放流)","水洗(浄化槽)","汲取り","なし"]
[" 【10.床面積】",null,1,2,3,4,5,6]
["①-5"]
[" 【1.番号】",null,1,2,3,4,5,6]
[" 【2.階】",null,1,2,3,4,5,6,7,8,9,10]
[" 【7.用途別床面積】","→","①-3　【8.主要用途】"]
[]
["①-6"]
[" 【1.番号】",null,1,2,3,4,5,6]
[" 【3.建築物の高さ等】"]
["  【ﾊ.階数】"]
["   地上","→","①-3　【13.建築物の高さ等】"]
["   地下","→","①-3　【13.建築物の高さ等】"]
[]
["③-2"]
["  ■ ",null,"■"]
[" 【5.主要用途】"]
["  （1）居住専用建築物",null,"01","02","03","04","05"]
["  （2）居住産業併用建築物",null,11,12,13,14,15,16,17,18,19,20,21,22,23,24,25,26,27,28,29,30,31,32,33,34,35,36,37,38,39,40,41,42,43,44,45,46,99]
["  （3）産業専用建築物",null,1,2,3,4,5,6]
[" 【6.一の建築物ごとの内容】"]
["   【ﾍ.地上の階数】",null,1,2,3,4,5,6,7,8,9,10]
["   【ﾄ.地下の階数】",null,1,2,3]
["③-3"]
[" 【5.主要用途】"]
["  【ｲ.番号】",null,1,2,3,4,5,6]
["  【ﾄ.戸数】",null,1,2,3,4,5,6,7,8,9,10,11,12,13,14,15,16,17,18,19,20]
["③-4"]
[" 【1.主要用途】",null,null," 【5.主要用途】"]
["  （1）居住専用建築物","→","③-2","  （1）居住専用建築物"]
["  （2）居住産業併用建築物","→","③-2","  （2）居住産業併用建築物"]
["  （3）産業専用建築物",null,1,2,3]
[]
["④-2"]
["  【ｲ.資　　格】","→","①-2 ","建築士"]
[null,"→","①-2 ","認可"]
["  【ﾊ.建築士事務所名】","→","#一般","都道府県"]
["  【ﾄ.作成した設計図書】","→","①-2 ","【ﾄ.作成した設計図書】"]
[" 【4.工事施工者】"]
["  【ﾛ.営業所名】","→","①-2 ","認可"]
[null,"→","①-2 ","  【ﾛ.営業所名】①"]
[null,"→","①-2 ","  【ﾛ.営業所名】②"]
[]
[" 【6.工作物の概要】"]
[null,"煙突","06310"]
[null,"鉄筋コンクリート造の柱","06320"]
[null,"鉄柱","06320"]
[null,"木柱","06320"]
[null,"広告塔","06330"]
[null,"広告板","06330"]
[null,"装飾塔","06330"]
[null,"記念塔","06330"]
[null,"高架水槽","06340"]
[null,"サイロ","06340"]
[null,"物見塔","06340"]
[null,"擁壁","06350"]
["  【ﾊ.構　　造】",null,"鉄筋コンクリート造","鉄骨造","鉄骨鉄筋コンクリート造","コンクリートブロック造"]
[]
["⑤-2"]
["  【ｲ.資　　格】","→","①-2 ","建築士"]
[null,"→","①-2 ","認可"]
["  【ﾊ.建築士事務所名】","→","#一般","都道府県"]
["  【ﾄ.作成した設計図書】","→","①-2 ","【ﾄ.作成した設計図書】"]
[" 【6.昇降機の概要】"]
["  【ｲ.種　　別】",null,"エレベーター","エレベーター（小荷物専用昇降機）","エスカレーター","いす式階段昇降機"]
["  【ﾛ.用　　途】",null,"乗用","寝台用","乗用（車いす用）","寝台用（車いす用）","荷物用","小荷物用"]
[]
["⑦-3"]
[" 【2.工事種別】"]
["  【ｲ.建築基準法施行令第１０条各号に掲げる建築物の区分】",null,1,2,3,4]

{"sheet":"チェックボックス管理","index":5,"n_rows":105,"n_cols":3,"rows_kept":105,"cut":false,"hidden":true,"merged":[[68,0,68,2],[69,0,69,2],[77,0,77,2],[1,0,1,2],[0,0,0,2],[9,0,9,2],[31,0,31,2],[53,0,53,2],[58,0,58,2]]}
["①確認申請書"]
["第二面 ①-2"]
["（構造設計一級建築士又は設備設計一級建築士である旨の表示をした者）","建築士法第20条の２第１項の表示をした者",false]
[null,"建築士法第20条の２第３項の表示をした者",false]
[null,"建築士法第20条の３第１項の表示をした者",false]
[null,"建築士法第20条の３第３項の表示をした者",false]
["【7.構造計算適合性判定の申請】","申請済",false]
[null,"未申請",false]
[null,"申請不要",false]
["第三面 ①-3"]
["【3.都市計画区域及び準都市計画区域の内外の別等】","都市計画区域内",false]
[null,"市街化区域",false]
[null,"市街化調整区域",false]
[null,"区域区分非設定",false]
[null,"準都市計画区域内",false]
[null,"都市計画区域及び準都市計画区域外",false]
["【4.防火地域】","防火地域",false]
[null,"準防火地域",false]
[null,"指定なし",false]
["【9.工事種別】","新築",false]
[null,"増築",false]
[null,"改築",false]
[null,"移転",false]
[null,"用途変更",false]
[null,"大規模の修繕",false]
[null,"大規模の模様替",false]
["【ﾆ.建築基準法第56条第7項の規定による特例の適用の有無】","有",false]
[null,"無",false]
["【ﾎ.適用があるときは、特例の区分】","道路高さ制限不適用",false]
[null,"隣地高さ制限不適用",false]
[null,"北側高さ制限不適用",false]
["第四面 ①-4"]
["【3.工事種別】","新築",false]
[null,"増築",false]
[null,"改築",false]
[null,"移転",false]
[null,"用途変更",false]
[null,"大規模の修繕",false]
[null,"大規模の模様替",false]
["【5.耐火建築物】","耐火建築物",false]
[null,"準耐火建築物（イ－１）",false]
[null,"準耐火建築物（イ－２）",false]
[null,"準耐火建築物（ロ－１）",false]
[null,"準耐火建築物（ロ－２）",false]
[null,"耐火構造建築物",false]
[null,"特定避難時間倒壊等防止建築物",false]
[null,"その他",false]
["【9.確認の特例】","有",false]
[null,"無",false]
[null,"有",false]
[null,"無",false]
[null,"建築基準法施行令第136条の2の11第1号イ",false]
[null,"建築基準法施行令第136条の2の11第1号ロ",false]
["第五面 ①-5"]
["【ﾛ.建築基準法施行令第３９条第３項に規定する特定天井】","有",false]
[null,"無",false]
["【ﾛ.建築基準法施行令第３９条第３項に規定する特定天井】","有",false]
[null,"無",false]
["第六面 ①-6"]
["【4.特定構造計算基準又は特定増改築構造計算基準の別】","特定構造計算基準",false]
[null,"特定増改築構造計算基準",false]
["【5.構造計算の区分】","建築基準法施行令第８１条第１項各号に掲げる基準に従った構造計算",false]
[null,"建築基準法施行令第８１条第２項第１号イに掲げる構造計算",false]
[null,"建築基準法施行令第８１条第２項第１号ロに掲げる構造計算",false]
[null,"建築基準法施行令第８１条第２項第２号イに掲げる構造計算",false]
[null,"建築基準法施行令第８１条第３項に掲げる構造計算",false]
["【6.構造計算に用いたプログラム】","建築基準法第２０条第１項第２号イ又は第３号イの認定を受けたプログラム",false]
[null,"その他のプログラム",false]
["⑥計画変更申請書(建築物）"]
["第二面 ⑥-2"]
["（構造設計一級建築士又は設備設計一級建築士である旨の表示をした者）","建築士法第20条の２第１項の表示をした者",false]
[null,"建築士法第20条の２第３項の表示をした者",false]
[null,"建築士法第20条の３第１項の表示をした者",false]
[null,"建築士法第20条の３第３項の表示をした者",false]
["【7.構造計算適合性判定の申請】","申請済",false]
[null,"未申請",false]
[null,"申請不要",false]
["第二面 ⑥-3"]
["【3.都市計画区域及び準都市計画区域の内外の別等】","都市計画区域内",false]
[null,"市街化区域",false]
[null,"市街化調整区域",false]
[null,"区域区分非設定",false]
[null,"準都市計画区域内",false]
[null,"都市計画区域及び準都市計画区域外",false]
["【4.防火地域】","防火地域",false]
[null,"準防火地域",false]
[null,"指定なし",false]
["【9.工事種別】","新築",false]
[null,"増築",false]
[null,"改築",false]
[null,"移転",false]
[null,"用途変更",false]
[null,"大規模の修繕",false]
[null,"大規模の模様替",false]
["【ﾆ.建築基準法第56条第7項の規定による特例の適用の有無】","有",false]
[null,"無",false]
["【ﾎ.適用があるときは、特例の区分】","道路高さ制限不適用",false]
[null,"隣地高さ制限不適用",false]
[null,"北側高さ制限不適用",false]
[]
["④-2"]
["【6.工作物の概要】","新築",false]
[null,"増築",false]
[null,"改築",false]
[null,"その他",false]